{"text_format":"1","workbook":"xlsx","n_sheets":3,"sheets":["Auswahl","Methoden","Hilfstabellen"],"not_rendered":{"charts":0,"images":0,"macros":1,"external_links":0,"defined_names":5,"comments":1,"pivot_tables":0},"unopened":[],"bounds":{"document_bytes":16777216,"sheet_cells":100000,"rows_first":2000,"rows_last":500,"rows_between":2000,"halvings":0,"cell_chars":16384,"cell_head_chars":4096},"cells_cut":0,"cells_raw":0,"read":"whole","date_system":"1900"}

{"sheet":"Auswahl","index":0,"n_rows":24,"n_cols":8,"rows_kept":24,"cut":false,"hidden":false,"merged":[[1,0,1,1]]}
["Anwendung:",null,null,null,null,"Beispielaufbau Doppelstunde",null,"Erstellt von Dominik Dallwitz-Wegner"]
["1. Trainingsziel auswählen",null,null,null,null,"Begrüßung, Glücksrunde",null,"Danke an alle Mitwirkenden - vor allem an die SinnStifter"]
["2. Button \"Methoden aktualisieren\" drücken",null,null,null,null,"Einführung",null,"Fragen bitte an: info@gluecksstifter.de"]
["bitte auf diesem Blatt sonst nichts ändern",null,null,null,null,"Methode 1"]
["für Erweiterungen: Blatt \"Methoden\"",null,null,null,null,"Methode 2"]
[null,null,null,null,null,"Reflexion"]
["Trainingsziel",null,null,"Kriterium",null,"Abschlussritual"]
["Gruppenenergie \nstärken",null,null,">0"]
[]
["Methoden","Modul2","Modul","Kriterium"]
["Antreiber Modell",2,"Träume und Lebensmotive",26]
["Balance Kreis","E","Energizer",19]
["Eierfall",2,"Träume und Lebensmotive",8]
["Gruppenstatue",2,"Träume und Lebensmotive",8]
["Ha Ho Za (Samurai)",3,"Leben bewegen",19]
["Ich bin ein Baum",3,"Leben bewegen",8]
["Klatsch Kreis","E","Energizer",22]
["Projektphasen",5,"Abenteuer Alltag",8]
["Rotes Band (Systemarbeit)",1,"Freude am Leben",8]
["Rubikonüberquerung",2,"Träume und Lebensmotive",8]
["Schwebender Ball",2,"Träume und Lebensmotive",8]
["Seilschaft",2,"Träume und Lebensmotive",8]
["Stockkampf",3,"Leben bewegen",31]
["Szenisches Spielen (Theaterpädagogik)",3,"Leben bewegen",8]

{"sheet":"Methoden","index":1,"n_rows":126,"n_cols":32,"rows_kept":126,"cut":false,"hidden":false,"merged":[]}
["Methoden","Modul2","Modul","Kriterium","Achtsamkeit","Dankbarkeit","Emotionen wahrnehmen und steuern","Empathie-Fähigkeit","Energetisieren","Entscheiden","Fehlerkultur","Gruppenenergie \nstärken","Haltung ändern","Handlungsziele","Kennenlernen","Kommunikation","Konflikte lösen","Kreativität fördern","Lösungsorientierung","Natur wahrnehmen","Ressourcen-Arbeit","Selbstwirksamkeit stärken","Stärken stärken","Vertrauen schaffen","Visionen und Herzenswunsch entwickeln","Werte entwickeln","Wertschätzung leben","Ziele erreichen","Feedback","Spalte4","Alle",9876]
["1 bis 21",4,{"$f":"VLOOKUP(B2,Hilfstabellen!$A$1:$B$7,2)","v":"Gestaltungspotentiale nutzen"},{"$f":"SEARCH(Suchkriterium,AE2)","v":{"$error":"#VALUE!"}},"Achtsamkeit",null,null,null,null,null,null,null,null,null,null,null,null,null,null,null,null,null,null,null,null,null,null,null,null,null,{"$f":"CONCATENATE(E2,\" \",F2,\" \",G2,\" \",H2,\" \",I2,\" \",J2,\" \",K2,\" \",L2,\" \",M2,\" \",N2,\" \",O2,\" \",P2,\" \",Q2,\" \",R2,\" \",S2,\" \",T2,\" \",U2,\" \",V2,\" \",W2,\" \",X2,\" \",Y2,\" \",Z2,\" \",AA2,\" \",AB2,\" \",AC2,\" \",AD2)","v":"Achtsamkeit                         "}]
["24 Charakterstärken",1,{"$f":"VLOOKUP(B3,Hilfstabellen!$A$1:$B$7,2)","v":"Freude am Leben"},{"$f":"SEARCH(Suchkriterium,AE3)","v":{"$error":"#VALUE!"}},null,null,null,null,null,null,null,null,"Haltung ändern",null,null,null,null,null,null,null,"Ressourcen-Arbeit",null,"Stärken stärken",null,null,"Werte entwickeln",null,null,null,null,"        Haltung ändern        Ressourcen-Arbeit  Stärken stärken   Werte entwickeln    "]
["5 Bälle","E",{"$f":"VLOOKUP(B4,Hilfstabellen!$A$1:$B$7,2)","v":"Energizer"},8,null,null,null,null,null,null,null,"Gruppenenergie \nstärken",null,null,"Kennenlernen",null,null,null,null,null,null,null,null,null,null,null,null,null,null,null,"       Gruppenenergie \nstärken   Kennenlernen               "]
["Active Constructive",1,{"$f":"VLOOKUP(B5,Hilfstabellen!$A$1:$B$7,2)","v":"Freude am Leben"},{"$error":"#VALUE!"},null,null,null,null,null,null,null,null,null,null,null,"Kommunikation","Konflikte lösen",null,null,null,null,null,null,null,null,null,null,null,null,null,"           Kommunikation Konflikte lösen             "]
["Aikido",3,{"$f":"VLOOKUP(B6,Hilfstabellen!$A$1:$B$7,2)","v":"Leben bewegen"},{"$error":"#VALUE!"},"Achtsamkeit",null,null,null,null,null,null,null,null,null,null,null,"Konflikte lösen",null,null,null,null,null,null,null,null,null,null,null,null,null,"Achtsamkeit            Konflikte lösen             "]
["Antreiber Modell",2,{"$f":"VLOOKUP(B7,Hilfstabellen!$A$1:$B$7,2)","v":"Träume und Lebensmotive"},26,null,null,null,"Empathie-Fähigkeit",null,null,null,"Gruppenenergie \nstärken",null,null,null,null,"Konflikte lösen",null,null,null,"Ressourcen-Arbeit","Selbstwirksamkeit stärken",null,null,"Visionen und Herzenswunsch entwickeln",null,null,null,null,null,"   Empathie-Fähigkeit    Gruppenenergie \nstärken     Konflikte lösen    Ressourcen-Arbeit Selbstwirksamkeit stärken   Visionen und Herzenswunsch entwickeln     "]
["Atemtechniken",6,{"$f":"VLOOKUP(B8,Hilfstabellen!$A$1:$B$7,2)","v":"Seelisches Wohlbefinden"},{"$error":"#VALUE!"},"Achtsamkeit",null,"Emotionen wahrnehmen und steuern",null,null,null,null,null,null,null,null,null,null,null,null,null,null,null,null,null,null,null,null,null,null,null,"Achtsamkeit  Emotionen wahrnehmen und steuern                       "]
["Autowaschanlage",3,{"$f":"VLOOKUP(B9,Hilfstabellen!$A$1:$B$7,2)","v":"Leben bewegen"},{"$error":"#VALUE!"},null,null,null,null,null,null,null,null,null,null,null,null,null,null,null,null,null,null,null,null,null,null,null,null,null,null,"                         "]
["Balance Kreis","E",{"$f":"VLOOKUP(B10,Hilfstabellen!$A$1:$B$7,2)","v":"Energizer"},19,"Achtsamkeit",null,null,null,null,null,null,"Gruppenenergie \nstärken",null,null,null,null,"Konflikte lösen",null,null,null,null,null,null,"Vertrauen schaffen",null,null,null,null,null,null,"Achtsamkeit       Gruppenenergie \nstärken     Konflikte lösen       Vertrauen schaffen      "]
["Balance Plattform (Systemarbeit)",1,{"$f":"VLOOKUP(B11,Hilfstabellen!$A$1:$B$7,2)","v":"Freude am Leben"},19,"Achtsamkeit",null,null,null,null,null,null,"Gruppenenergie \nstärken","Haltung ändern",null,null,"Kommunikation","Konflikte lösen",null,null,null,null,null,null,"Vertrauen schaffen",null,null,null,null,null,null,"Achtsamkeit       Gruppenenergie \nstärken Haltung ändern   Kommunikation Konflikte lösen       Vertrauen schaffen      "]
["Balkenlauf",2,{"$f":"VLOOKUP(B12,Hilfstabellen!$A$1:$B$7,2)","v":"Träume und Lebensmotive"},{"$error":"#VALUE!"},"Achtsamkeit",null,null,null,null,null,null,null,null,null,null,null,null,null,null,null,null,null,null,"Vertrauen schaffen",null,null,null,null,null,null,"Achtsamkeit                   Vertrauen schaffen      "]
["Benjamin Franklin Strategie",2,{"$f":"VLOOKUP(B13,Hilfstabellen!$A$1:$B$7,2)","v":"Träume und Lebensmotive"},{"$error":"#VALUE!"},null,null,null,null,null,null,null,null,null,null,null,null,null,null,null,null,null,null,null,null,null,"Werte entwickeln",null,null,null,null,"                     Werte entwickeln    "]
["Benjamin Franklin Werte-Tagebuch",2,{"$f":"VLOOKUP(B14,Hilfstabellen!$A$1:$B$7,2)","v":"Träume und Lebensmotive"},{"$error":"#VALUE!"},null,null,null,null,null,null,null,null,null,null,null,null,null,null,null,null,"Ressourcen-Arbeit",null,null,null,null,"Werte entwickeln",null,null,null,null,"                Ressourcen-Arbeit     Werte entwickeln    "]
["Benjamin Franklin Werte-Tugenden",2,{"$f":"VLOOKUP(B15,Hilfstabellen!$A$1:$B$7,2)","v":"Träume und Lebensmotive"},{"$error":"#VALUE!"},null,null,null,null,null,null,null,null,null,null,null,null,null,null,null,null,"Ressourcen-Arbeit",null,null,null,null,"Werte entwickeln",null,null,null,null,"                Ressourcen-Arbeit     Werte entwickeln    "]
["Bildhauer & Statue",4,{"$f":"VLOOKUP(B16,Hilfstabellen!$A$1:$B$7,2)","v":"Gestaltungspotentiale nutzen"},{"$error":"#VALUE!"},null,null,null,null,null,null,null,null,null,null,null,null,null,null,null,null,null,"Selbstwirksamkeit stärken",null,null,null,null,null,null,null,null,"                 Selbstwirksamkeit stärken        "]
["Billidibillidbop","E",{"$f":"VLOOKUP(B17,Hilfstabellen!$A$1:$B$7,2)","v":"Energizer"},{"$error":"#VALUE!"},null,null,null,null,"Energetisieren",null,null,null,null,null,null,null,null,null,null,null,null,null,null,null,null,null,null,null,null,null,"    Energetisieren                     "]
["Buchstaben bilden",2,{"$f":"VLOOKUP(B18,Hilfstabellen!$A$1:$B$7,2)","v":"Träume und Lebensmotive"},{"$error":"#VALUE!"},null,null,null,null,"Energetisieren",null,null,null,null,null,null,null,null,"Kreativität fördern",null,null,null,null,null,null,null,null,null,null,null,null,"    Energetisieren         Kreativität fördern            "]
["Charakterstärken",1,{"$f":"VLOOKUP(B19,Hilfstabellen!$A$1:$B$7,2)","v":"Freude am Leben"},{"$error":"#VALUE!"},null,null,null,null,null,null,null,null,null,null,null,null,null,null,null,null,"Ressourcen-Arbeit",null,"Stärken stärken",null,null,null,null,null,null,null,"                Ressourcen-Arbeit  Stärken stärken       "]
["Charakterstärken",1,{"$f":"VLOOKUP(B20,Hilfstabellen!$A$1:$B$7,2)","v":"Freude am Leben"},{"$error":"#VALUE!"},null,null,null,null,null,null,null,null,null,null,null,"Kommunikation",null,null,null,null,null,null,null,null,null,null,null,null,null,null,"           Kommunikation              "]
["Dankbarkeitsbrief",1,{"$f":"VLOOKUP(B21,Hilfstabellen!$A$1:$B$7,2)","v":"Freude am Leben"},{"$error":"#VALUE!"},null,"Dankbarkeit",null,null,null,null,null,null,null,null,null,null,null,null,null,null,null,null,null,null,null,null,"Wertschätzung leben",null,null,null," Dankbarkeit                     Wertschätzung leben   "]
["Dankbarkeitssteine",1,{"$f":"VLOOKUP(B22,Hilfstabellen!$A$1:$B$7,2)","v":"Freude am Leben"},{"$error":"#VALUE!"},null,"Dankbarkeit",null,null,null,null,null,null,null,null,null,null,null,null,null,null,null,null,null,null,null,null,"Wertschätzung leben",null,null,null," Dankbarkeit                     Wertschätzung leben   "]
["Das kleine Glück",1,{"$f":"VLOOKUP(B23,Hilfstabellen!$A$1:$B$7,2)","v":"Freude am Leben"},{"$error":"#VALUE!"},"Achtsamkeit",null,null,null,null,null,null,null,null,null,null,null,null,null,null,null,"Ressourcen-Arbeit",null,"Stärken stärken",null,null,null,null,null,null,null,"Achtsamkeit                Ressourcen-Arbeit  Stärken stärken       "]
["Das rote Sofa","E",{"$f":"VLOOKUP(B24,Hilfstabellen!$A$1:$B$7,2)","v":"Energizer"},{"$error":"#VALUE!"},null,null,null,null,"Energetisieren",null,null,null,null,null,null,null,null,null,null,null,null,null,null,null,null,null,null,null,null,null,"    Energetisieren                     "]
["Deutlich sprechen",3,{"$f":"VLOOKUP(B25,Hilfstabellen!$A$1:$B$7,2)","v":"Leben bewegen"},{"$error":"#VALUE!"},null,null,null,null,null,null,null,null,null,null,null,"Kommunikation",null,null,null,null,null,null,null,null,null,null,null,null,null,null,"           Kommunikation              "]
["Deutlich sprechen",4,{"$f":"VLOOKUP(B26,Hilfstabellen!$A$1:$B$7,2)","v":"Gestaltungspotentiale nutzen"},{"$error":"#VALUE!"},null,null,null,null,null,null,null,null,null,null,null,"Kommunikation",null,null,null,null,null,null,null,null,null,null,null,null,null,null,"           Kommunikation              "]
["Die Riesen in mir",1,{"$f":"VLOOKUP(B27,Hilfstabellen!$A$1:$B$7,2)","v":"Freude am Leben"},{"$error":"#VALUE!"},null,null,null,null,null,null,null,null,null,null,null,null,null,null,null,null,null,null,"Stärken stärken",null,null,null,null,null,null,null,"                  Stärken stärken       "]
["Eierfall",2,{"$f":"VLOOKUP(B28,Hilfstabellen!$A$1:$B$7,2)","v":"Träume und Lebensmotive"},20,null,null,null,null,null,null,"Fehlerkultur","Gruppenenergie \nstärken",null,null,null,null,null,null,"Lösungsorientierung",null,null,null,"Stärken stärken",null,null,null,null,null,null,null,"      Fehlerkultur Gruppenenergie \nstärken       Lösungsorientierung    Stärken stärken       "]
["Emotions Memory",1,{"$f":"VLOOKUP(B29,Hilfstabellen!$A$1:$B$7,2)","v":"Freude am Leben"},{"$error":"#VALUE!"},null,null,"Emotionen wahrnehmen und steuern","Empathie-Fähigkeit",null,null,null,null,null,null,null,"Kommunikation",null,null,null,null,null,null,null,null,null,null,null,null,null,null,"  Emotionen wahrnehmen und steuern Empathie-Fähigkeit        Kommunikation              "]
["Energie Ball",2,{"$f":"VLOOKUP(B30,Hilfstabellen!$A$1:$B$7,2)","v":"Träume und Lebensmotive"},{"$error":"#VALUE!"},null,null,null,null,"Energetisieren",null,null,null,null,null,null,null,null,null,null,null,null,null,null,null,null,null,null,null,null,null,"    Energetisieren                     "]
["Entscheidungen ausloten",4,{"$f":"VLOOKUP(B31,Hilfstabellen!$A$1:$B$7,2)","v":"Gestaltungspotentiale nutzen"},{"$error":"#VALUE!"},null,null,null,null,null,"Entscheiden",null,null,null,"Handlungsziele",null,null,null,null,null,null,null,null,null,null,null,null,null,"Ziele erreichen",null,null,"     Entscheiden    Handlungsziele              Ziele erreichen  "]
["Erste Ansprache",3,{"$f":"VLOOKUP(B32,Hilfstabellen!$A$1:$B$7,2)","v":"Leben bewegen"},{"$error":"#VALUE!"},null,null,null,null,null,null,null,null,null,null,null,null,null,null,null,null,null,null,"Stärken stärken",null,null,null,null,null,null,null,"                  Stärken stärken       "]
["Feind-Beschützer",3,{"$f":"VLOOKUP(B33,Hilfstabellen!$A$1:$B$7,2)","v":"Leben bewegen"},{"$error":"#VALUE!"},"Achtsamkeit",null,null,null,null,null,null,null,null,null,null,null,null,null,null,null,null,null,null,null,null,null,null,null,null,null,"Achtsamkeit                         "]
["Finde deinen Stein",6,{"$f":"VLOOKUP(B34,Hilfstabellen!$A$1:$B$7,2)","v":"Seelisches Wohlbefinden"},{"$f":"SEARCH(Suchkriterium,AE34)","v":{"$error":"#VALUE!"}},null,null,null,null,null,null,null,null,null,null,null,null,null,null,null,"Natur wahrnehmen",null,null,null,null,null,null,null,null,null,null,"               Natur wahrnehmen          "]
["Flick-Flack","E",{"$f":"VLOOKUP(B35,Hilfstabellen!$A$1:$B$7,2)","v":"Energizer"},{"$error":"#VALUE!"},null,null,null,null,"Energetisieren",null,"Fehlerkultur",null,null,null,"Kennenlernen",null,null,null,null,null,null,null,null,null,null,null,null,null,null,null,"    Energetisieren  Fehlerkultur    Kennenlernen               "]
["Flow-Stärken Karte",1,{"$f":"VLOOKUP(B36,Hilfstabellen!$A$1:$B$7,2)","v":"Freude am Leben"},{"$f":"SEARCH(Suchkriterium,AE36)","v":{"$error":"#VALUE!"}},null,null,null,"Empathie-Fähigkeit",null,null,"Fehlerkultur",null,null,null,null,"Kommunikation",null,null,null,null,"Ressourcen-Arbeit","Selbstwirksamkeit stärken","Stärken stärken",null,null,null,"Wertschätzung leben",null,null,null,"   Empathie-Fähigkeit   Fehlerkultur     Kommunikation     Ressourcen-Arbeit Selbstwirksamkeit stärken Stärken stärken    Wertschätzung leben   "]
["Führen lassen",1,{"$f":"VLOOKUP(B37,Hilfstabellen!$A$1:$B$7,2)","v":"Freude am Leben"},{"$error":"#VALUE!"},"Achtsamkeit",null,null,null,null,null,null,null,null,null,null,null,null,null,null,null,null,null,null,"Vertrauen schaffen",null,null,null,null,null,null,"Achtsamkeit                   Vertrauen schaffen      "]
["Gang imitieren",3,{"$f":"VLOOKUP(B38,Hilfstabellen!$A$1:$B$7,2)","v":"Leben bewegen"},{"$error":"#VALUE!"},"Achtsamkeit",null,null,null,null,null,null,null,null,null,null,null,null,null,null,null,null,null,null,null,null,null,null,null,null,null,"Achtsamkeit                         "]
["Glückliche Entscheidungen",4,{"$f":"VLOOKUP(B39,Hilfstabellen!$A$1:$B$7,2)","v":"Gestaltungspotentiale nutzen"},{"$error":"#VALUE!"},null,null,null,null,null,"Entscheiden",null,null,null,null,null,null,null,null,null,null,null,null,null,null,null,null,null,"Ziele erreichen",null,null,"     Entscheiden                  Ziele erreichen  "]
["Gordischer Knoten",1,{"$f":"VLOOKUP(B40,Hilfstabellen!$A$1:$B$7,2)","v":"Freude am Leben"},8,null,null,null,null,null,null,null,"Gruppenenergie \nstärken",null,null,"Kennenlernen",null,null,null,null,null,null,null,null,null,null,null,null,null,null,null,"       Gruppenenergie \nstärken   Kennenlernen               "]
["Gruppendynamik",5,{"$f":"VLOOKUP(B41,Hilfstabellen!$A$1:$B$7,2)","v":"Abenteuer Alltag"},{"$error":"#VALUE!"},null,null,null,null,null,null,null,null,null,null,null,null,"Konflikte lösen",null,null,null,null,null,null,null,null,null,null,null,null,null,"            Konflikte lösen             "]
["Gruppenstatue",2,{"$f":"VLOOKUP(B42,Hilfstabellen!$A$1:$B$7,2)","v":"Träume und Lebensmotive"},8,null,null,null,null,null,null,null,"Gruppenenergie \nstärken",null,null,null,null,null,null,null,null,null,null,null,null,null,null,null,null,null,null,"       Gruppenenergie \nstärken                  "]
["Guter Ruf",2,{"$f":"VLOOKUP(B43,Hilfstabellen!$A$1:$B$7,2)","v":"Träume und Lebensmotive"},{"$error":"#VALUE!"},null,null,null,null,"Energetisieren",null,null,null,null,null,"Kennenlernen",null,null,null,null,null,null,null,null,null,null,null,null,null,null,null,"    Energetisieren      Kennenlernen               "]
["Ha Ho Za (Samurai)",3,{"$f":"VLOOKUP(B44,Hilfstabellen!$A$1:$B$7,2)","v":"Leben bewegen"},19,"Achtsamkeit",null,null,null,null,null,null,"Gruppenenergie \nstärken",null,null,null,null,null,null,null,null,null,null,null,null,null,null,null,null,null,null,"Achtsamkeit       Gruppenenergie \nstärken                  "]
["Haltungsziel-Bild",2,{"$f":"VLOOKUP(B45,Hilfstabellen!$A$1:$B$7,2)","v":"Träume und Lebensmotive"},{"$error":"#VALUE!"},null,null,null,null,null,null,null,null,"Haltung ändern",null,null,null,null,null,null,null,"Ressourcen-Arbeit",null,null,null,null,null,null,null,null,null,"        Haltung ändern        Ressourcen-Arbeit         "]
["Halungsziel-Bild Skalenlauf",2,{"$f":"VLOOKUP(B46,Hilfstabellen!$A$1:$B$7,2)","v":"Träume und Lebensmotive"},{"$error":"#VALUE!"},null,null,null,null,null,null,null,null,"Haltung ändern",null,null,null,null,null,"Lösungsorientierung",null,null,null,"Stärken stärken",null,null,null,null,null,null,null,"        Haltung ändern      Lösungsorientierung    Stärken stärken       "]
["HKT - Baum",2,{"$f":"VLOOKUP(B47,Hilfstabellen!$A$1:$B$7,2)","v":"Träume und Lebensmotive"},{"$error":"#VALUE!"},null,null,null,null,null,null,null,null,null,null,null,null,null,null,null,null,null,"Selbstwirksamkeit stärken",null,null,null,null,null,null,null,null,"                 Selbstwirksamkeit stärken        "]
["HKT - Konzentration",2,{"$f":"VLOOKUP(B48,Hilfstabellen!$A$1:$B$7,2)","v":"Träume und Lebensmotive"},{"$error":"#VALUE!"},null,null,null,null,null,null,null,null,null,null,null,null,null,null,null,null,null,"Selbstwirksamkeit stärken",null,null,null,null,null,null,null,null,"                 Selbstwirksamkeit stärken        "]
["HKT - Symbole",2,{"$f":"VLOOKUP(B49,Hilfstabellen!$A$1:$B$7,2)","v":"Träume und Lebensmotive"},{"$error":"#VALUE!"},null,null,null,null,null,null,null,null,null,null,null,null,null,null,null,null,null,"Selbstwirksamkeit stärken",null,null,null,null,null,null,null,null,"                 Selbstwirksamkeit stärken        "]
["Ich bin ein Baum",3,{"$f":"VLOOKUP(B50,Hilfstabellen!$A$1:$B$7,2)","v":"Leben bewegen"},8,null,null,null,null,null,null,null,"Gruppenenergie \nstärken",null,null,null,null,null,null,null,null,null,null,null,null,null,null,null,null,null,null,"       Gruppenenergie \nstärken                  "]
["Ich bin zu spät",4,{"$f":"VLOOKUP(B51,Hilfstabellen!$A$1:$B$7,2)","v":"Gestaltungspotentiale nutzen"},{"$error":"#VALUE!"},null,null,null,null,null,null,null,null,"Haltung ändern",null,null,null,"Konflikte lösen",null,null,null,null,null,null,null,null,null,null,null,null,null,"        Haltung ändern    Konflikte lösen             "]
["Jeux Dramatique",5,{"$f":"VLOOKUP(B52,Hilfstabellen!$A$1:$B$7,2)","v":"Abenteuer Alltag"},{"$error":"#VALUE!"},null,null,null,null,null,null,null,null,null,null,null,null,null,"Kreativität fördern",null,null,null,null,null,"Vertrauen schaffen",null,null,null,null,null,null,"             Kreativität fördern      Vertrauen schaffen      "]
["Johari Fenster",1,{"$f":"VLOOKUP(B53,Hilfstabellen!$A$1:$B$7,2)","v":"Freude am Leben"},{"$error":"#VALUE!"},null,null,null,null,null,null,null,null,"Haltung ändern",null,null,null,null,null,null,null,null,null,null,null,null,null,null,null,null,null,"        Haltung ändern                 "]
["Keksdose",3,{"$f":"VLOOKUP(B54,Hilfstabellen!$A$1:$B$7,2)","v":"Leben bewegen"},{"$error":"#VALUE!"},null,null,null,null,null,null,null,null,null,null,null,"Kommunikation",null,null,null,null,null,null,null,null,null,null,null,null,null,null,"           Kommunikation              "]
["Kevin allein zu Hause","E",{"$f":"VLOOKUP(B55,Hilfstabellen!$A$1:$B$7,2)","v":"Energizer"},{"$error":"#VALUE!"},null,null,null,null,"Energetisieren",null,null,null,null,null,null,null,null,null,null,null,null,null,null,null,null,null,null,null,null,null,"    Energetisieren                     "]
["Klangwald",6,{"$f":"VLOOKUP(B56,Hilfstabellen!$A$1:$B$7,2)","v":"Seelisches Wohlbefinden"},{"$error":"#VALUE!"},null,null,null,null,null,null,null,null,null,null,null,null,null,null,null,"Natur wahrnehmen",null,null,null,null,null,null,null,null,null,null,"               Natur wahrnehmen          "]
["Klatsch Battle","E",{"$f":"VLOOKUP(B57,Hilfstabellen!$A$1:$B$7,2)","v":"Energizer"},{"$error":"#VALUE!"},null,null,null,null,"Energetisieren",null,"Fehlerkultur",null,null,null,null,null,null,null,null,null,null,null,null,null,null,null,null,null,null,null,"    Energetisieren  Fehlerkultur                   "]
["Klatsch Kreis","E",{"$f":"VLOOKUP(B58,Hilfstabellen!$A$1:$B$7,2)","v":"Energizer"},22,null,null,null,null,"Energetisieren",null,null,"Gruppenenergie \nstärken",null,null,null,null,null,null,null,null,null,null,null,null,null,null,null,null,null,null,"    Energetisieren   Gruppenenergie \nstärken                  "]
["Kommunikationsstile",5,{"$f":"VLOOKUP(B59,Hilfstabellen!$A$1:$B$7,2)","v":"Abenteuer Alltag"},{"$error":"#VALUE!"},null,null,null,null,null,null,null,null,null,null,null,"Kommunikation","Konflikte lösen",null,null,null,null,null,null,null,null,null,null,null,null,null,"           Kommunikation Konflikte lösen             "]
["Körperteilgehen",3,{"$f":"VLOOKUP(B60,Hilfstabellen!$A$1:$B$7,2)","v":"Leben bewegen"},{"$error":"#VALUE!"},"Achtsamkeit",null,null,null,null,null,null,null,null,null,null,null,null,null,null,null,null,null,null,null,null,null,null,null,null,null,"Achtsamkeit                         "]
{"$rows_left_out":67}
{"sheet":"Hilfstabellen","index":2,"n_rows":7,"n_cols":2,"rows_kept":7,"cut":false,"hidden":true,"merged":[]}
[1,"Freude am Leben"]
[2,"Träume und Lebensmotive"]
[3,"Leben bewegen"]
[4,"Gestaltungspotentiale nutzen"]
[5,"Abenteuer Alltag"]
[6,"Seelisches Wohlbefinden"]
["E","Energizer"]